OpenVZ Forum


Home » International » German » Fehler beim kompilieren
Fehler beim kompilieren [message #22770] Sat, 03 November 2007 11:29
Aldo is currently offline  Aldo
Messages: 7
Registered: April 2007
Junior Member
From: *dip.t-dialin.net
Hallo,

beim kompilieren eines 2.6.20er Kernels erhalte ich folgende Fehler:
Quote:

kernel/cpt/cpt_process.c: In function 'dump_one_process':
kernel/cpt/cpt_process.c:793: error: 'struct nsproxy' has no member named 'namespace'
kernel/cpt/cpt_process.c:807: error: 'struct nsproxy' has no member named 'namespace'
kernel/cpt/cpt_process.c:808: error: 'struct nsproxy' has no member named 'namespace'
kernel/cpt/cpt_process.c:838: warning: comparison of distinct pointer types lacks a cast
make[2]: *** [kernel/cpt/cpt_process.o] Error 1
make[1]: *** [kernel/cpt] Error 2
make: *** [kernel] Error 2


Hat jemand eine Idee wie ich das lösen könnte?
Es handelt sich um ein x86_64 / Debian Etch

[Updated on: Sat, 03 November 2007 11:30]

Report message to a moderator

Previous Topic: [SOLVED] OpenVZ und 64-bit CentOS 5
Next Topic: Trixbox 2.0 /2.2 in VS Umgebung
Goto Forum:
  


Current Time: Mon Aug 20 00:41:30 GMT 2018